Ticket #1338: osdtypeteletext.h.err.txt

File osdtypeteletext.h.err.txt, 488 bytes (added by anonymous, 15 years ago)
Line 
1distcc[14407] ERROR: compile /root/.ccache/tv_play.tmp.mythtv.14393.ii on localhost failed
2In file included from tv_play.cpp:18:
3osdtypeteletext.h:90: error: syntax error before `;' token
4osdtypeteletext.h:101: error: syntax error before `;' token
5make[2]: *** [tv_play.o] Error 1
6make[2]: Leaving directory `/usr/src/Mythtv-9051/mythtv/libs/libmythtv'
7make[1]: *** [sub-libmythtv] Error 2
8make[1]: Leaving directory `/usr/src/Mythtv-9051/mythtv/libs'
9make: *** [sub-libs] Error 2