Ticket #3079: make.log

File make.log, 19.9 KB (added by mattsch@…, 13 years ago)

Log of compilation errors

Line 
1./configure --prefix=/usr/local --enable-xvmc --enable-xvmc-opengl --cpu=athlon64 --enable-proc-opt --enable-dvb
2# Basic Settings
3Compile type     release
4Compiler cache   no
5DistCC           no
6Install prefix   /usr/local
7CPU              x86_64 (athlon64)
8big-endian       no
9MMX enabled      yes
10
11# Input Support
12Joystick menu    yes
13lirc support     yes
14Apple Remote     no
15Video4Linux sup. yes
16ivtv support     yes
17FireWire support yes
18DVB support      yes [/usr/include]
19DBox2 support    yes
20HDHomeRun sup.   yes
21IPTV support     yes
22
23# Sound Output Support
24OSS support      yes
25ALSA support     yes
26aRts support     yes
27JACK support     no
28DTS passthrough  no
29
30# Video Output Support
31x11 support      yes
32xrandr support   yes
33xv support       yes
34XvMC support     yes
35XvMC VLD support yes
36XvMC pro support no
37XvMC OpenGL sup. no
38XvMC libs        -lXvMCW
39Mac acceleration no
40OpenGL vsync     no
41DirectFB         no
42
43# Misc Features
44Frontend         yes
45Backend          yes
46
47# Bindings
48bindings_perl    yes
49Creating libs/libmyth/mythconfig.h and libs/libmyth/mythconfig.mak
50
51WARNING: When using --enable-proc-opt you must include the
52         output of ./configure along with any bug report.
53
54
55make
56cd libs && make -f Makefile
57make[1]: Entering directory `/usr/src/mythtv-trunk/mythtv/libs'
58cd libavutil && make -f Makefile
59make[2]: Entering directory `/usr/src/mythtv-trunk/mythtv/libs/libavutil'
60make[2]: Nothing to be done for `first'.
61make[2]: Leaving directory `/usr/src/mythtv-trunk/mythtv/libs/libavutil'
62cd libavcodec && make -f Makefile
63make[2]: Entering directory `/usr/src/mythtv-trunk/mythtv/libs/libavcodec'
64make[2]: Nothing to be done for `first'.
65make[2]: Leaving directory `/usr/src/mythtv-trunk/mythtv/libs/libavcodec'
66cd libavformat && make -f Makefile
67make[2]: Entering directory `/usr/src/mythtv-trunk/mythtv/libs/libavformat'
68make[2]: Nothing to be done for `first'.
69make[2]: Leaving directory `/usr/src/mythtv-trunk/mythtv/libs/libavformat'
70cd libmythsamplerate && make -f Makefile
71make[2]: Entering directory `/usr/src/mythtv-trunk/mythtv/libs/libmythsamplerate'
72make[2]: Nothing to be done for `first'.
73make[2]: Leaving directory `/usr/src/mythtv-trunk/mythtv/libs/libmythsamplerate'
74cd libmythsoundtouch && make -f Makefile
75make[2]: Entering directory `/usr/src/mythtv-trunk/mythtv/libs/libmythsoundtouch'
76make[2]: Nothing to be done for `first'.
77make[2]: Leaving directory `/usr/src/mythtv-trunk/mythtv/libs/libmythsoundtouch'
78cd libmythmpeg2 && make -f Makefile
79make[2]: Entering directory `/usr/src/mythtv-trunk/mythtv/libs/libmythmpeg2'
80make[2]: Nothing to be done for `first'.
81make[2]: Leaving directory `/usr/src/mythtv-trunk/mythtv/libs/libmythmpeg2'
82cd libmythdvdnav && make -f Makefile
83make[2]: Entering directory `/usr/src/mythtv-trunk/mythtv/libs/libmythdvdnav'
84make[2]: Nothing to be done for `first'.
85make[2]: Leaving directory `/usr/src/mythtv-trunk/mythtv/libs/libmythdvdnav'
86cd libmyth && make -f Makefile
87make[2]: Entering directory `/usr/src/mythtv-trunk/mythtv/libs/libmyth'
88g++ -c -pipe -march=athlon64 -I/usr/kde/3.5/include/artsc -pthread -I/usr/include/glib-2.0 -I/usr/lib64/glib-2.0/include -O3 -fomit-frame-pointer -Wall -Wno-switch -Wno-non-virtual-dtor -fomit-frame-pointer -D_REENTRANT -Wall -W -DPIC -fPIC  -DMMX -D_GNU_SOURCE -D_FILE_OFFSET_BITS=64 -DPREFIX="/usr/local" -DLIBDIR="/usr/local/lib" -DUSING_OSS -DUSE_ALSA -DUSE_JOYSTICK_MENU -DUSE_LIRC -DUSE_ARTS -DUSING_XRANDR -DQT_NO_DEBUG -DQT_GUI_LIB -DQT_CORE_LIB -DQT_SHARED -I/usr/share/qt4/mkspecs/linux-g++ -I. -I/usr/include/qt4/QtCore -I/usr/include/qt4/QtCore -I/usr/include/qt4/QtGui -I/usr/include/qt4/QtGui -I/usr/include/qt4 -I/usr/local/include -I/usr/include -I/usr/include -I../libmythsamplerate -I../libmythsoundtouch -I../.. -I.. -I. -I. -o dialogbox.o dialogbox.cpp
89In file included from dialogbox.h:6,
90                 from dialogbox.cpp:11:
91mythdialogs.h:7:18: error: qdom.h: No such file or directory
92mythdialogs.h:8:22: error: qptrlist.h: No such file or directory
93mythdialogs.h:13:26: error: qvaluevector.h: No such file or directory
94mythdialogs.h:14:25: error: qscrollview.h: No such file or directory
95In file included from ../libmythui/mythmainwindow.h:12,
96                 from mythdialogs.h:51,
97                 from dialogbox.h:6,
98                 from dialogbox.cpp:11:
99../libmythui/mythuitype.h:6:25: error: qobjectlist.h: No such file or directory
100In file included from dialogbox.cpp:12:
101mythcontext.h:13:23: error: qnetwork.h: No such file or directory
102In file included from mythobservable.h:6,
103                 from mythcontext.h:21,
104                 from dialogbox.cpp:12:
105mythevent.h:7:23: error: qdeepcopy.h: No such file or directory
106In file included from mythcontext.h:22,
107                 from dialogbox.cpp:12:
108mythsocket.h:4:27: error: qsocketdevice.h: No such file or directory
109In file included from dialogbox.cpp:13:
110mythwidgets.h:4:21: error: qbutton.h: No such file or directory
111mythwidgets.h:14:21: error: qheader.h: No such file or directory
112mythwidgets.h:15:20: error: qtable.h: No such file or directory
113mythwidgets.h:17:22: error: qlistbox.h: No such file or directory
114../libmythui/xmlparsebase.h:15: error: 'QDomElement' has not been declared
115../libmythui/xmlparsebase.h:17: error: 'QDomElement' has not been declared
116../libmythui/xmlparsebase.h:19: error: 'QDomElement' has not been declared
117../libmythui/xmlparsebase.h:21: error: 'QDomElement' has not been declared
118../libmythui/xmlparsebase.h:23: error: 'QDomElement' has not been declared
119../libmythui/xmlparsebase.h:29: error: expected ';' before '(' token
120../libmythui/xmlparsebase.h:32: error: expected ';' before '(' token
121../libmythui/mythuitype.h:33: error: ISO C++ forbids declaration of 'QValueVector' with no type
122../libmythui/mythuitype.h:33: error: expected ';' before '<' token
123../libmythui/mythuitype.h:81: error: 'QCustomEvent' has not been declared
124../libmythui/mythuitype.h:106: error: 'QPtrList' has not been declared
125../libmythui/mythuitype.h:106: error: expected ',' or '...' before '<' token
126../libmythui/mythuitype.h:119: error: 'QDomElement' has not been declared
127../libmythui/mythuitype.h:124: error: ISO C++ forbids declaration of 'QValueVector' with no type
128../libmythui/mythuitype.h:124: error: expected ';' before '<' token
129../libmythui/mythscreenstack.h:22: error: 'QValueVector' has not been declared
130../libmythui/mythscreenstack.h:22: error: expected ',' or '...' before '<' token
131../libmythui/mythscreenstack.h:33: error: ISO C++ forbids declaration of 'QValueVector' with no type
132../libmythui/mythscreenstack.h:33: error: expected ';' before '<' token
133../libmythui/mythscreenstack.h:34: error: ISO C++ forbids declaration of 'QValueVector' with no type
134../libmythui/mythscreenstack.h:34: error: expected ';' before '<' token
135../libmythui/mythscreenstack.h:42: error: ISO C++ forbids declaration of 'QValueVector' with no type
136../libmythui/mythscreenstack.h:42: error: expected ';' before '<' token
137../libmythui/mythmainwindow.h:21: error: expected class-name before '{' token
138../libmythui/mythmainwindow.h: In constructor 'ExternalKeycodeEvent::ExternalKeycodeEvent(int)':
139../libmythui/mythmainwindow.h:24: error: class 'ExternalKeycodeEvent' does not have any field named 'QCustomEvent'
140../libmythui/mythmainwindow.h: At global scope:
141../libmythui/mythmainwindow.h:33: error: expected class-name before '{' token
142../libmythui/mythmainwindow.h: In constructor 'ExitToMainMenuEvent::ExitToMainMenuEvent()':
143../libmythui/mythmainwindow.h:35: error: class 'ExitToMainMenuEvent' does not have any field named 'QCustomEvent'
144../libmythui/mythmainwindow.h: At global scope:
145../libmythui/mythmainwindow.h:130: error: 'QCustomEvent' has not been declared
146mythdialogs.h:118: error: ISO C++ forbids declaration of 'QButton' with no type
147mythdialogs.h:118: error: expected ';' before '*' token
148mythdialogs.h:207: error: ISO C++ forbids declaration of 'QPtrList' with no type
149mythdialogs.h:207: error: expected ';' before '<' token
150mythdialogs.h:267: error: 'QDomElement' has not been declared
151mythdialogs.h:268: error: 'QDomElement' has not been declared
152mythdialogs.h:269: error: 'QDomElement' has not been declared
153mythdialogs.h:270: error: 'QDomElement' has not been declared
154mythdialogs.h:317: error: ISO C++ forbids declaration of 'QDomElement' with no type
155mythdialogs.h:317: error: expected ';' before '&' token
156mythdialogs.h:319: error: expected `;' before 'QPixmap'
157mythdialogs.h:327: error: 'QDomElement' does not name a type
158mythdialogs.h:330: error: ISO C++ forbids declaration of 'QPtrList' with no type
159mythdialogs.h:330: error: expected ';' before '<' token
160mythdialogs.h:331: error: ISO C++ forbids declaration of 'QPtrList' with no type
161mythdialogs.h:331: error: expected ';' before '<' token
162mythdialogs.h:398: error: ISO C++ forbids declaration of 'QButton' with no type
163mythdialogs.h:398: error: expected ';' before '*' token
164mythdialogs.h:399: error: ISO C++ forbids declaration of 'QButton' with no type
165mythdialogs.h:399: error: expected ';' before '*' token
166mythdialogs.h:413: error: ISO C++ forbids declaration of 'QValueVector' with no type
167mythdialogs.h:413: error: expected ';' before '<' token
168mythdialogs.h:426: error: 'IntVector' has not been declared
169mythdialogs.h:427: error: 'IntVector' has not been declared
170mythdialogs.h:450: error: expected class-name before '{' token
171mythdialogs.h:450: warning: 'class MythScrollDialog' has virtual functions but non-virtual destructor
172mythevent.h:16: error: expected class-name before '{' token
173mythevent.h:18: error: 'User' was not declared in this scope
174mythevent.h: In constructor 'MythEvent::MythEvent(int)':
175mythevent.h:20: error: class 'MythEvent' does not have any field named 'QCustomEvent'
176mythevent.h: In constructor 'MythEvent::MythEvent(QString)':
177mythevent.h:23: error: class 'MythEvent' does not have any field named 'QCustomEvent'
178mythevent.h:25: error: 'QDeepCopy' was not declared in this scope
179mythevent.h:25: error: expected primary-expression before '>' token
180mythevent.h:26: error: no match for 'operator=' in '((MythEvent*)this)->MythEvent::extradata = "empty"'
181/usr/include/qt4/QtCore/qstringlist.h:47: note: candidates are: QStringList& QStringList::operator=(const QStringList&)
182mythevent.h: In constructor 'MythEvent::MythEvent(QString, const QStringList&)':
183mythevent.h:30: error: class 'MythEvent' does not have any field named 'QCustomEvent'
184mythevent.h:32: error: 'QDeepCopy' was not declared in this scope
185mythevent.h:32: error: expected primary-expression before '>' token
186mythobservable.h: At global scope:
187mythobservable.h:113: error: ISO C++ forbids declaration of 'QPtrList' with no type
188mythobservable.h:113: error: expected ';' before '<' token
189mythobservable.h:137: error: ISO C++ forbids declaration of 'QPtrList' with no type
190mythobservable.h:137: error: expected ';' before '<' token
191mythsocket.h:25: error: expected class-name before '{' token
192mythsocket.h:47: error: expected ',' or '...' before 'error'
193mythsocket.h:47: error: ISO C++ forbids declaration of 'Error' with no type
194mythsocket.h:49: error: 'Type' has not been declared
195mythsocket.h:52: error: 'Q_LONG' does not name a type
196mythsocket.h:53: error: 'Q_LONG' does not name a type
197mythsocket.h:57: error: 'Q_ULONG' has not been declared
198mythsocket.h:59: error: 'Q_UINT16' has not been declared
199mythsocket.h:60: error: 'Q_UINT16' has not been declared
200mythsocket.h:72: error: field 'm_addr' has incomplete type
201mythsocket.h:73: error: 'Q_UINT16' does not name a type
202mythsocket.h:86: error: ISO C++ forbids declaration of 'QPtrList' with no type
203mythsocket.h:86: error: expected ';' before '<' token
204mythsocket.h:87: error: ISO C++ forbids declaration of 'QPtrList' with no type
205mythsocket.h:87: error: expected ';' before '<' token
206mythsocket.h:88: error: ISO C++ forbids declaration of 'QPtrList' with no type
207mythsocket.h:88: error: expected ';' before '<' token
208mythsocket.h:99: error: 'QPtrList' is not a template
209mythsocket.h:49: error: 'QSocketDevice' has not been declared
210mythsocket.h: In member function 'QString MythSocket::errorToString()':
211mythsocket.h:46: error: 'error' was not declared in this scope
212mythcontext.h: At global scope:
213mythcontext.h:299: error: ISO C++ forbids declaration of 'QValueList' with no type
214mythcontext.h:299: error: expected ';' before '<' token
215mythcontext.h:439: error: ISO C++ forbids declaration of 'QValueList' with no type
216mythcontext.h:439: error: expected ';' before '<' token
217mythwidgets.h: In constructor 'MythComboBox::MythComboBox(bool, QWidget*, const char*)':
218mythwidgets.h:45: error: no matching function for call to 'QComboBox::QComboBox(bool&, QWidget*&, const char*&)'
219/usr/include/qt4/QtGui/qcombobox.h:281: note: candidates are: QComboBox::QComboBox(const QComboBox&)
220/usr/include/qt4/QtGui/qcombobox.h:277: note:                 QComboBox::QComboBox(QComboBoxPrivate&, QWidget*)
221/usr/include/qt4/QtGui/qcombobox.h:70: note:                 QComboBox::QComboBox(QWidget*)
222mythwidgets.h: In member function 'void MythComboBox::insertItem(const QString&)':
223mythwidgets.h:65: error: no matching function for call to 'MythComboBox::insertItem(const QString&)'
224/usr/include/qt4/QtGui/qcombobox.h:303: note: candidates are: void QComboBox::insertItem(int, const QString&, const QVariant&)
225/usr/include/qt4/QtGui/qcombobox.h:180: note:                 void QComboBox::insertItem(int, const QIcon&, const QString&, const QVariant&)
226mythwidgets.h: In constructor 'MythSpinBox::MythSpinBox(QWidget*, const char*, bool)':
227mythwidgets.h:90: error: no matching function for call to 'QSpinBox::QSpinBox(QWidget*&, const char*&)'
228/usr/include/qt4/QtGui/qspinbox.h:101: note: candidates are: QSpinBox::QSpinBox(const QSpinBox&)
229/usr/include/qt4/QtGui/qspinbox.h:49: note:                 QSpinBox::QSpinBox(QWidget*)
230mythwidgets.h:90: error: 'setLineStep' was not declared in this scope
231mythwidgets.h: In constructor 'MythSlider::MythSlider(QWidget*, const char*)':
232mythwidgets.h:115: error: no matching function for call to 'QSlider::QSlider(QWidget*&, const char*&)'
233/usr/include/qt4/QtGui/qslider.h:103: note: candidates are: QSlider::QSlider(const QSlider&)
234/usr/include/qt4/QtGui/qslider.h:65: note:                 QSlider::QSlider(Qt::Orientation, QWidget*)
235/usr/include/qt4/QtGui/qslider.h:64: note:                 QSlider::QSlider(QWidget*)
236mythwidgets.h: In constructor 'MythLineEdit::MythLineEdit(QWidget*, const char*)':
237mythwidgets.h:137: error: no matching function for call to 'QLineEdit::QLineEdit(QWidget*&, const char*&)'
238/usr/include/qt4/QtGui/qlineedit.h:235: note: candidates are: QLineEdit::QLineEdit(const QLineEdit&)
239/usr/include/qt4/QtGui/qlineedit.h:65: note:                 QLineEdit::QLineEdit(const QString&, QWidget*)
240/usr/include/qt4/QtGui/qlineedit.h:64: note:                 QLineEdit::QLineEdit(QWidget*)
241mythwidgets.h: In constructor 'MythLineEdit::MythLineEdit(const QString&, QWidget*, const char*)':
242mythwidgets.h:142: error: no matching function for call to 'QLineEdit::QLineEdit(const QString&, QWidget*&, const char*&)'
243/usr/include/qt4/QtGui/qlineedit.h:235: note: candidates are: QLineEdit::QLineEdit(const QLineEdit&)
244/usr/include/qt4/QtGui/qlineedit.h:65: note:                 QLineEdit::QLineEdit(const QString&, QWidget*)
245/usr/include/qt4/QtGui/qlineedit.h:64: note:                 QLineEdit::QLineEdit(QWidget*)
246mythwidgets.h: At global scope:
247mythwidgets.h:259: error: expected class-name before '{' token
248mythwidgets.h: In constructor 'MythTable::MythTable(QWidget*)':
249mythwidgets.h:261: error: class 'MythTable' does not have any field named 'QTable'
250mythwidgets.h: In constructor 'MythPushButton::MythPushButton(QWidget*, const char*, bool)':
251mythwidgets.h:279: error: no matching function for call to 'QPushButton::QPushButton(QWidget*&, const char*&)'
252/usr/include/qt4/QtGui/qpushbutton.h:89: note: candidates are: QPushButton::QPushButton(const QPushButton&)
253/usr/include/qt4/QtGui/qpushbutton.h:47: note:                 QPushButton::QPushButton(const QIcon&, const QString&, QWidget*)
254/usr/include/qt4/QtGui/qpushbutton.h:46: note:                 QPushButton::QPushButton(const QString&, QWidget*)
255/usr/include/qt4/QtGui/qpushbutton.h:45: note:                 QPushButton::QPushButton(QWidget*)
256mythwidgets.h:280: error: 'WindowOrigin' was not declared in this scope
257mythwidgets.h:280: error: 'setBackgroundOrigin' was not declared in this scope
258mythwidgets.h:281: error: 'setToggleButton' was not declared in this scope
259mythwidgets.h: In constructor 'MythPushButton::MythPushButton(const QString&, QWidget*, bool)':
260mythwidgets.h:285: error: 'WindowOrigin' was not declared in this scope
261mythwidgets.h:285: error: 'setBackgroundOrigin' was not declared in this scope
262mythwidgets.h:286: error: 'setToggleButton' was not declared in this scope
263mythwidgets.h: In constructor 'MythCheckBox::MythCheckBox(QWidget*, const char*)':
264mythwidgets.h:320: error: no matching function for call to 'QCheckBox::QCheckBox(QWidget*&, const char*&)'
265/usr/include/qt4/QtGui/qcheckbox.h:84: note: candidates are: QCheckBox::QCheckBox(const QCheckBox&)
266/usr/include/qt4/QtGui/qcheckbox.h:43: note:                 QCheckBox::QCheckBox(const QString&, QWidget*)
267/usr/include/qt4/QtGui/qcheckbox.h:42: note:                 QCheckBox::QCheckBox(QWidget*)
268mythwidgets.h: In constructor 'MythCheckBox::MythCheckBox(const QString&, QWidget*, const char*)':
269mythwidgets.h:322: error: no matching function for call to 'QCheckBox::QCheckBox(const QString&, QWidget*&, const char*&)'
270/usr/include/qt4/QtGui/qcheckbox.h:84: note: candidates are: QCheckBox::QCheckBox(const QCheckBox&)
271/usr/include/qt4/QtGui/qcheckbox.h:43: note:                 QCheckBox::QCheckBox(const QString&, QWidget*)
272/usr/include/qt4/QtGui/qcheckbox.h:42: note:                 QCheckBox::QCheckBox(QWidget*)
273mythwidgets.h: In constructor 'MythRadioButton::MythRadioButton(QWidget*, const char*)':
274mythwidgets.h:342: error: no matching function for call to 'QRadioButton::QRadioButton(QWidget*&, const char*&)'
275/usr/include/qt4/QtGui/qradiobutton.h:59: note: candidates are: QRadioButton::QRadioButton(const QRadioButton&)
276/usr/include/qt4/QtGui/qradiobutton.h:41: note:                 QRadioButton::QRadioButton(const QString&, QWidget*)
277/usr/include/qt4/QtGui/qradiobutton.h:40: note:                 QRadioButton::QRadioButton(QWidget*)
278mythwidgets.h: At global scope:
279mythwidgets.h:363: error: expected ',' or '...' before '*' token
280mythwidgets.h:363: error: ISO C++ forbids declaration of 'QListViewItem' with no type
281mythwidgets.h:370: error: expected class-name before '{' token
282mythwidgets.h:370: warning: 'class MythListBox' has virtual functions but non-virtual destructor
283mythwidgets.h: In member function 'void MythListBox::setCurrentItem(int)':
284mythwidgets.h:387: error: 'QListBox' has not been declared
285dialogbox.cpp: In constructor 'DialogBox::DialogBox(MythMainWindow*, const QString&, const char*, const char*)':
286dialogbox.cpp:21: error: 'class QLabel' has no member named 'setBackgroundOrigin'
287dialogbox.cpp:21: error: 'WindowOrigin' was not declared in this scope
288dialogbox.cpp:22: error: 'WordBreak' is not a member of 'Qt'
289dialogbox.cpp:24: error: no matching function for call to 'QVBoxLayout::QVBoxLayout(DialogBox* const, int, int)'
290/usr/include/qt4/QtGui/qboxlayout.h:138: note: candidates are: QVBoxLayout::QVBoxLayout(const QVBoxLayout&)
291/usr/include/qt4/QtGui/qboxlayout.h:126: note:                 QVBoxLayout::QVBoxLayout(QWidget*)
292/usr/include/qt4/QtGui/qboxlayout.h:125: note:                 QVBoxLayout::QVBoxLayout()
293dialogbox.cpp:33: error: 'class QCheckBox' has no member named 'setBackgroundOrigin'
294dialogbox.cpp:40: error: 'class QButtonGroup' has no member named 'insert'
295dialogbox.cpp: In member function 'void DialogBox::AddButton(const QString&)':
296dialogbox.cpp:48: error: 'class QButtonGroup' has no member named 'count'
297dialogbox.cpp:49: error: 'class QButtonGroup' has no member named 'count'
298dialogbox.cpp:54: error: 'class QButtonGroup' has no member named 'insert'
299dialogbox.cpp: In member function 'void DialogBox::buttonPressed(int)':
300dialogbox.cpp:61: error: 'class QButtonGroup' has no member named 'find'
301make[2]: *** [dialogbox.o] Error 1
302make[2]: Leaving directory `/usr/src/mythtv-trunk/mythtv/libs/libmyth'
303make[1]: *** [sub-libmyth-make_default-ordered] Error 2
304make[1]: Leaving directory `/usr/src/mythtv-trunk/mythtv/libs'
305make: *** [sub-libs-make_default-ordered] Error 2
306