Ticket #5432: mythcontext_error

File mythcontext_error, 7.3 KB (added by anonymous, 12 years ago)

output from failed compile of mythcontext

Line 
1/usr/lib64/qt-3.3/include/qimage.h: In member function ‘bool QImageTextKeyLang::operator<(const QImageTextKeyLang&) const’:
2/usr/lib64/qt-3.3/include/qimage.h:61: warning: suggest parentheses around && within ||
3g++ -c -pipe -march=k8 -fomit-frame-pointer -O3 -Wall -Wno-switch -Wpointer-arith -Wredundant-decls -Wno-non-virtual-dtor -D__STDC_CONSTANT_MACROS -D_REENTRANT -DPIC -fPIC  -DMMX -D_GNU_SOURCE -D_FILE_OFFSET_BITS=64 -DRUNPREFIX=\\\"/usr/local\\\" -DUSING_OSS -DUSE_ALSA -DUSE_JOYSTICK_MENU -DUSING_X11 -DUSING_XRANDR -DQT_NO_DEBUG -DQT_THREAD_SUPPORT -DQT_SHARED -DQT_TABLET_SUPPORT -I/usr/lib64/qt-3.3/mkspecs/default -I. -I../../../../../../local/include -I../../../../../../include -I../libmythsamplerate -I../libmythsoundtouch -I../libmythfreesurround -I../libavcodec -I../libavutil -I../.. -I.. -I. -I/usr/lib64/qt-3.3/include -o mythcontext.o mythcontext.cpp
4<command-line>: warning: missing terminating " character
5mythcontext.cpp:316: error: stray ‘\’ in program
6mythcontext.cpp:316:24: warning: missing terminating " character
7mythcontext.cpp:316: error: missing terminating " character
8In file included from mythcontext.cpp:4:
9/usr/lib64/qt-3.3/include/qimage.h: In member function ‘bool QImageTextKeyLang::operator<(const QImageTextKeyLang&) const’:
10/usr/lib64/qt-3.3/include/qimage.h:61: warning: suggest parentheses around && within ||
11mythcontext.cpp: In constructor ‘MythContextPrivate::MythContextPrivate(MythContext*)’:
12mythcontext.cpp:317: error: ‘((MythContextPrivate*)this)->MythContextPrivate::m_gui’ cannot be used as a function
13mythcontext.cpp:317: error: ‘((MythContextPrivate*)this)->MythContextPrivate::m_backend’ cannot be used as a function
14mythcontext.cpp:317: error: ‘((MythContextPrivate*)this)->MythContextPrivate::m_themeloaded’ cannot be used as a function
15mythcontext.cpp:318: error: no match for call to ‘(QString) (const QString&)’
16mythcontext.cpp:318: error: no match for call to ‘(QString) (const QString&)’
17mythcontext.cpp:319: error: ‘((MythContextPrivate*)this)->MythContextPrivate::m_backgroundimage’ cannot be used as a function
18mythcontext.cpp:320: error: ‘((MythContextPrivate*)this)->MythContextPrivate::m_xbase’ cannot be used as a function
19mythcontext.cpp:320: error: ‘((MythContextPrivate*)this)->MythContextPrivate::m_ybase’ cannot be used as a function
20mythcontext.cpp:320: error: ‘((MythContextPrivate*)this)->MythContextPrivate::m_height’ cannot be used as a function
21mythcontext.cpp:320: error: ‘((MythContextPrivate*)this)->MythContextPrivate::m_width’ cannot be used as a function
22mythcontext.cpp:321: error: ‘((MythContextPrivate*)this)->MythContextPrivate::m_baseWidth’ cannot be used as a function
23mythcontext.cpp:321: error: ‘((MythContextPrivate*)this)->MythContextPrivate::m_baseHeight’ cannot be used as a function
24mythcontext.cpp:322: error: no match for call to ‘(QString) (const QString&)’
25mythcontext.cpp:323: error: ‘((MythContextPrivate*)this)->MythContextPrivate::m_UPnP’ cannot be used as a function
26mythcontext.cpp:323: error: ‘((MythContextPrivate*)this)->MythContextPrivate::m_XML’ cannot be used as a function
27mythcontext.cpp:323: error: ‘((MythContextPrivate*)this)->MythContextPrivate::m_HTTP’ cannot be used as a function
28mythcontext.cpp:324: error: no match for call to ‘(QMutex) (bool)’
29mythcontext.cpp:325: error: ‘((MythContextPrivate*)this)->MythContextPrivate::attemptingToConnect’ cannot be used as a function
30mythcontext.cpp:326: error: no match for call to ‘(QString) (const char [1])’
31mythcontext.cpp:327: error: ‘((MythContextPrivate*)this)->MythContextPrivate::mainWindow’ cannot be used as a function
32mythcontext.cpp:328: error: ‘((MythContextPrivate*)this)->MythContextPrivate::m_wmult’ cannot be used as a function
33mythcontext.cpp:328: error: ‘((MythContextPrivate*)this)->MythContextPrivate::m_hmult’ cannot be used as a function
34mythcontext.cpp:329: error: ‘((MythContextPrivate*)this)->MythContextPrivate::m_screenxbase’ cannot be used as a function
35mythcontext.cpp:329: error: ‘((MythContextPrivate*)this)->MythContextPrivate::m_screenybase’ cannot be used as a function
36mythcontext.cpp:329: error: ‘((MythContextPrivate*)this)->MythContextPrivate::m_screenwidth’ cannot be used as a function
37mythcontext.cpp:329: error: ‘((MythContextPrivate*)this)->MythContextPrivate::m_screenheight’ cannot be used as a function
38mythcontext.cpp:330: error: ‘((MythContextPrivate*)this)->MythContextPrivate::m_geometry_x’ cannot be used as a function
39mythcontext.cpp:330: error: ‘((MythContextPrivate*)this)->MythContextPrivate::m_geometry_y’ cannot be used as a function
40mythcontext.cpp:330: error: ‘((MythContextPrivate*)this)->MythContextPrivate::m_geometry_w’ cannot be used as a function
41mythcontext.cpp:330: error: ‘((MythContextPrivate*)this)->MythContextPrivate::m_geometry_h’ cannot be used as a function
42mythcontext.cpp:331: error: no match for call to ‘(QString) (const QString&)’
43mythcontext.cpp:332: error: ‘((MythContextPrivate*)this)->MythContextPrivate::bigfontsize’ cannot be used as a function
44mythcontext.cpp:332: error: ‘((MythContextPrivate*)this)->MythContextPrivate::mediumfontsize’ cannot be used as a function
45mythcontext.cpp:332: error: ‘((MythContextPrivate*)this)->MythContextPrivate::smallfontsize’ cannot be used as a function
46mythcontext.cpp:333: error: ‘((MythContextPrivate*)this)->MythContextPrivate::serverSock’ cannot be used as a function
47mythcontext.cpp:333: error: ‘((MythContextPrivate*)this)->MythContextPrivate::eventSock’ cannot be used as a function
48mythcontext.cpp:334: error: ‘((MythContextPrivate*)this)->MythContextPrivate::disablelibrarypopup’ cannot be used as a function
49mythcontext.cpp:335: error: ‘((MythContextPrivate*)this)->MythContextPrivate::pluginmanager’ cannot be used as a function
50mythcontext.cpp:336: error: ‘((MythContextPrivate*)this)->MythContextPrivate::screensaver’ cannot be used as a function
51mythcontext.cpp:337: error: ‘((MythContextPrivate*)this)->MythContextPrivate::m_logenable’ cannot be used as a function
52mythcontext.cpp:337: error: ‘((MythContextPrivate*)this)->MythContextPrivate::m_logmaxcount’ cannot be used as a function
53mythcontext.cpp:337: error: ‘((MythContextPrivate*)this)->MythContextPrivate::m_logprintlevel’ cannot be used as a function
54mythcontext.cpp:338: error: ‘((MythContextPrivate*)this)->MythContextPrivate::screensaverEnabled’ cannot be used as a function
55mythcontext.cpp:339: error: ‘((MythContextPrivate*)this)->MythContextPrivate::display_res’ cannot be used as a function
56mythcontext.cpp:340: error: ‘((MythContextPrivate*)this)->MythContextPrivate::useSettingsCache’ cannot be used as a function
57mythcontext.cpp:1500: error: ‘d’ was not declared in this scope
58mythcontext.cpp:1500: error: ‘binversion’ was not declared in this scope
59mythcontext.cpp:1500: error: ‘app_binary_version’ was not declared in this scope
60mythcontext.cpp:4040: error: expected `{' at end of input
61make[2]: *** [mythcontext.o] Error 1
62make[2]: Leaving directory `/usr/src/mythtv-021.fixes/mythtv-release-0.21/mythtv/libs/libmyth'
63make[1]: *** [sub-libmyth] Error 2
64make[1]: Leaving directory `/usr/src/mythtv-021.fixes/mythtv-release-0.21/mythtv/libs'
65make: *** [sub-libs] Error 2
66[13:56:03] [root on workstation] /usr/src/mythtv-021.fixes/mythtv-release-0.21/mythtv >:
67
68